Folio,Deleg,Unidmed,Id_Unid,Fecha_D,Fecha_M,Fecha_A,Hr_Ini_H,Hr_Ini_M,Hr_Fin_H,Hr_Fin_M,Lugaraplic,Edoproc,Id_Unidproc,Tipopac,Edad,Sexo,Escolar,Ocupa1,Identif_Enc,Parent_Pacm,Sexo_Pacm,Edad_Pacm,Escolar2,Ocupa2,Tipodhu,Discap_A,Discap_B,Discap_C,Discap_D,Discap_E,Discap_F,Fig_Corp,Act_Fis_Mod,Act_Fis_Vig,Tmp_Actfis_Mod_H,Tmp_Actfis_Mod_M,Tmp_Actfis_Vig_H,Tmp_Actfis_Vig_M,Fuma100,Fuma_Act,Frec_Alcohol,Exc_Alcohol,Estres,Sat1,Sat3,Sat3_Mot1,Sat3_Mot2,Sat3_Mot3,Servatn1_1,Servatn1_2,Servatn1_3,Probsal1,Probsal2,Probsal3,Btratou,Btratou_Mot1,Btratou_Mot2,Btratou_Mot3,Calfatna_C,Calfatnb_C,Calfatna_E,Calfatnb_E,Calfatna_A,Calfatnb_A,Calfatna_G,Calfatnb_G,Calfatna_H,Calfatnb_H,Calfatna_N,Calfatnb_N,Calfatna_K,Calfatnb_K,Calfatna_L,Calfatnb_L,Calfatna_J,Calfatnb_J,Calfatna_M,Calfatnb_M,Calfatna_Q,Calfatnb_Q,Calfatna_I,Calfatnb_I,Saludar,Escuchar,Responder,Permproced,Comincom,Comincom_Mot,Fechahosp_D,Fechahosp_M,Fechahosp_A,Med_Hosp,Tcama,Tiecahos,Present_Med,Frec_Med,Infoenferm,Info_Medichosp,Info_Saludhosp,Sufinfo,Info_Clarahosp,Comcirec,Filtrocir,Numciru,Fechaciru1_D,Fechaciru1_M,Fechaciru1_A,Fechaciru2_D,Fechaciru2_M,Fechaciru2_A,Fechaciru3_D,Fechaciru3_M,Fechaciru3_A,Progciru,Topera,Topera_P,Topera_N,Fechaop,Suspop1,Suspop3,Suspop4,Motoper,Medciru,Info_Medic,Consinfor,Info_Saludcir,Info_Claracir,Grad_Conf,Calciru,Motcalifcir1,Motcalifcir2,Motcalifcir3,Exp_Instservcir1,Exp_Instservcir2,Exp_Instservcir3,Dolor,Tiemdolc,Escdol,Med_Dolor,Tmpo_Med_Dolor,Indi_Casa,Indimed,Med_Indi,Med_Indisal,Med_Indisal2,Comida,Mot_Comida,Prev_Caida_A,Prev_Caida_B,Prev_Caida_C,Prev_Caida_D,Prev_Caida_E,Caida,Acc_Caida1,Acc_Caida2,Acc_Caida3,Calfinmb_L1,Calfinmb_L3,Calfinmb_L2,Calfinmb_F,Calfinmb_I,Calfinmb_J,Calfinmb_B1,Limp2,Calhosp,Motcal_Hosp1,Motcal_Hosp2,Motcal_Hosp3,Exp_Instservhosp1,Exp_Instservhosp2,Exp_Instservhosp3,Recmedhoy,Filtrofarm2,Totmed,Motnosurt,Acnomed,Gasto_Bolsilloa1,Gasto_Bolsillob1,Gasto_Bolsilloa2,Gasto_Bolsillob2,Gasto_Bolsilloa3,Gasto_Bolsillob3,Gasto_Bolsilloa4,Gasto_Bolsillob4,Gasto_Bolsilloa5,Gasto_Bolsillob5,Cal1,Id_Unidad,Cve_Delegaci�N,Delegaci�N,Nivel,Unidad,Promedio_Diario2018,Estrato,Moscondia,Fe_Finalnr,Fecha,Entidad
115411108,1,HGZ 1 Aguascalientes,11,12,11,2019,12,45,12,59,1,1,5,2,38,1,5,5,2,1,2,14,4,,5,2,2,2,2,2,2,,,,,,,,,,,,,2,1,,,,1,16,,119,,,1,,,,1,10,1,10,1,10,1,10,1,10,1,10,1,10,1,10,1,10,2,,2,,1,10,1,1,1,1,2,,30,10,2019,1,6,3,1,4,1,1,4,1,2,2,1,1,8,11,2019,,,,,,,4,5,1,5,1,,,,2,1,1,1,1,2,10,2,,,,995,,,2,,,,,1,1,1,1,1,2,,1,2,2,2,2,2,,,,10,10,10,10,10,99,10,1,2,,,,998,,,1,1,1,,,2,,2,,2,,2,,2,,2,11,1,Aguascalientes,2,HGZ 1 Aguascalientes,706,1,1,4.688658119,2019-11-12,1
115438008,1,HGZ 1 Aguascalientes,11,12,11,2019,15,10,15,30,1,1,5,1,59,1,2,5,1,,,,,,5,2,1,2,2,2,2,6,97,97,,,,,2,2,13,,5,2,2,,,,7,14,,51,,,2,,,,1,10,1,10,2,,1,10,2,,2,,1,10,2,,2,,2,,2,,1,10,1,1,1,1,2,,11,11,2019,2,60,2,1,4,1,1,99,,,2,1,1,11,11,2019,,,,,,,2,99999,99999,99999,1,,,,32,1,1,1,1,2,10,1,,,,2,16,18,2,,,,,1,2,1,1,1,2,,1,2,1,99,2,2,,,,10,10,10,10,99,10,99,99,1,,,,4,2,,1,2,,,,2,,2,,2,,2,,2,,1,11,1,Aguascalientes,2,HGZ 1 Aguascalientes,706,1,1,4.77402769,2019-11-12,1
115438009,1,HGZ 1 Aguascalientes,11,12,11,2019,16,11,16,28,1,1,2,1,72,1,1,5,1,,,,,,5,2,2,2,2,2,2,9,97,97,,,,,2,2,13,,3,2,2,,,,7,19,52,10,12,13,2,,,,1,10,1,10,2,,1,10,2,,2,,2,,2,,2,,2,,2,,1,10,1,1,1,1,2,,8,11,2019,3,120,4,1,4,1,1,5,3,4,2,2,,,,,,,,,,,,,,,,,,,,,,,,,,,,,,,,,2,,,,,1,2,1,1,1,2,,1,2,2,2,2,2,,,,10,10,8,10,99,99,10,1,1,,,,16,1,24,1,1,1,,,2,,2,,2,,2,,2,,2,11,1,Aguascalientes,2,HGZ 1 Aguascalientes,706,1,1,5.23961815,2019-11-12,1
115438010,1,HGZ 1 Aguascalientes,11,12,11,2019,16,29,16,45,1,1,5,1,52,1,7,10,1,,,,,,1,2,2,2,2,2,2,2,97,97,,,,,2,2,13,,1,1,2,,,,14,,,51,,,1,,,,1,10,1,10,2,,2,,2,,1,10,1,10,2,,2,,2,,2,,1,10,1,1,1,1,2,,11,11,2019,4,10,2,1,3,1,1,2,3,2,2,1,1,12,11,2019,,,,,,,2,30,3,1,1,,,,32,1,1,1,1,2,10,2,,,,1,2,16,2,,,,,1,2,1,1,1,2,,1,2,2,2,2,2,,,,8,8,8,8,99,99,8,1,2,,,,1,3,17,1,1,1,,,2,,2,,2,,2,,2,,2,11,1,Aguascalientes,2,HGZ 1 Aguascalientes,706,1,1,4.678268982,2019-11-12,1
115438011,1,HGZ 1 Aguascalientes,11,12,11,2019,16,53,17,8,1,1,5,1,37,2,4,1,1,,,,,,1,2,2,2,2,2,2,5,6,6,0,30,8,0,1,1,7,8,4,2,2,,,,29,,,116,,,2,,,,1,9,1,9,2,,1,9,2,,2,,1,10,2,,2,,2,,2,,1,10,1,1,1,1,2,,8,11,2019,2,30,2,1,1,1,1,3,1,2,2,2,,,,,,,,,,,,,,,,,,,,,,,,,,,,,,,,,2,,,,,1,2,1,1,1,2,,1,1,1,2,1,2,,,,10,9,9,9,10,10,8,1,2,,,,995,,,2,2,,,,2,,2,,2,,2,,2,,2,11,1,Aguascalientes,2,HGZ 1 Aguascalientes,706,1,1,5.311367832,2019-11-12,1
115451942,1,HGZ 1 Aguascalientes,11,12,11,2019,17,10,17,27,1,1,2041,1,24,1,6,2,1,,,,,,1,2,2,2,2,2,2,4,97,97,,,,,2,2,12,96,1,2,2,,,,1,,,37,,,2,,,,1,8,1,10,2,,2,,2,,2,,1,10,1,10,1,10,2,,1,10,1,10,1,1,2,1,2,,8,11,2019,3,1080,4,1,8,1,1,3,3,4,2,2,,,,,,,,,,,,,,,,,,,,,,,,,,,,,,,,,1,,10,1,30,2,,,2,,2,,1,2,1,2,2,2,,,,10,10,4,10,99,5,10,1,2,,,,2,18,19,1,2,,,,2,,2,,2,,2,,2,,2,11,1,Aguascalientes,2,HGZ 1 Aguascalientes,706,1,1,2.666957732,2019-11-12,1
115659927,1,HGZ 1 Aguascalientes,11,14,11,2019,11,44,11,56,1,1,2041,1,22,1,5,2,1,,,,,,1,2,2,2,2,2,2,5,5,97,0,20,,,1,2,13,,5,2,1,,,,3,,,46,,,1,,,,1,10,1,10,1,9,2,,2,,2,,1,10,2,,2,,2,,2,,1,10,1,1,1,1,2,,13,11,2019,3,240,4,1,5,1,1,3,1,1,2,2,,,,,,,,,,,,,,,,,,,,,,,,,,,,,,,,,2,,,,,2,,,1,1,1,,1,1,1,1,1,2,,,,10,10,10,10,99,99,10,1,1,,,,995,,,2,2,,,,2,,2,,2,,2,,2,,1,11,1,Aguascalientes,2,HGZ 1 Aguascalientes,706,1,1,2.666957732,2019-11-14,1
115663412,1,HGZ 1 Aguascalientes,11,14,11,2019,11,57,12,12,1,1,2,1,57,1,5,1,1,,,,,,2,2,2,2,2,2,2,6,97,97,,,,,1,2,13,,4,1,1,,,,2,,,116,,,1,,,,1,9,1,10,1,10,1,10,2,,2,,1,10,1,6,1,8,2,,2,,1,8,1,1,1,1,2,,8,11,2019,3,1440,3,1,3,1,1,1,1,1,2,2,,,,,,,,,,,,,,,,,,,,,,,,,,,,,,,,,2,,,,,1,2,1,1,1,1,,1,2,1,2,2,2,,,,10,10,10,10,99,99,10,1,1,,,,19,,,1,1,1,,,2,,2,,2,,2,,2,,1,11,1,Aguascalientes,2,HGZ 1 Aguascalientes,706,1,1,4.77402769,2019-11-14,1
115665234,1,HGZ 1 Aguascalientes,11,14,11,2019,12,13,12,30,1,1,2,1,24,1,7,5,1,,,,,,5,2,2,2,2,2,2,2,3,97,0,20,,,2,2,13,,4,5,1,,,,3,,,46,,,2,,,,1,10,1,10,1,10,2,,2,,2,,1,10,2,,1,10,2,,2,,1,10,1,1,1,1,2,,12,11,2019,4,600,5,1,1,97,1,3,1,1,2,1,1,13,11,2019,,,,,,,4,1,1,1,1,,,,1,1,1,1,1,1,10,1,,,,1,,,1,3,9,1,5,1,1,1,1,1,1,,1,2,2,2,2,2,,,,9,10,8,10,99,10,10,1,1,,,,995,,,2,2,,,,2,,2,,2,,2,,2,,1,11,1,Aguascalientes,2,HGZ 1 Aguascalientes,706,1,1,2.666957732,2019-11-14,1
115666945,1,HGZ 1 Aguascalientes,11,14,11,2019,12,30,12,43,1,1,2041,2,22,1,5,5,2,1,2,1,,,5,2,2,97,2,97,2,,,,,,,,,,,,,2,2,,,,4,,,31,,,1,,,,1,10,1,10,1,10,1,10,1,10,2,,1,10,1,10,1,10,2,,1,10,1,10,1,1,1,1,2,,8,11,2019,3,1440,2,1,3,1,1,99,,,2,2,,,,,,,,,,,,,,,,,,,,,,,,,,,,,,,,,2,,,,,1,3,1,1,1,1,,1,1,1,1,1,2,,,,10,10,10,10,99,99,10,1,1,,,,995,,,1,1,1,,,2,,2,,2,,2,,2,,1,11,1,Aguascalientes,2,HGZ 1 Aguascalientes,706,1,1,2.666957732,2019-11-14,1
115668529,1,HGZ 1 Aguascalientes,11,14,11,2019,11,42,12,3,1,1,2,1,37,1,5,5,1,,,,,,5,2,2,2,2,2,2,6,4,97,0,30,,,2,2,11,9,4,1,1,,,,3,,,69,,,1,,,,1,10,1,9,1,10,2,,2,,2,,1,10,1,10,1,10,2,,2,,1,10,1,1,1,1,2,,12,11,2019,2,15,2,1,2,1,1,97,,,2,1,1,13,11,2019,,,,,,,2,30,3,1,1,,,,4,3,1,1,2,,10,1,,,,995,,,1,2,4,1,5,1,3,1,1,1,1,,1,1,2,2,2,2,,,,10,10,10,10,10,10,10,1,1,,,,995,,,2,2,,,,2,,2,,2,,2,,2,,1,11,1,Aguascalientes,2,HGZ 1 Aguascalientes,706,1,1,4.688658119,2019-11-14,1
115668530,1,HGZ 1 Aguascalientes,11,14,11,2019,12,4,12,24,1,1,10,1,25,1,7,5,1,,,,,,1,2,2,2,2,2,2,5,97,97,,,,,2,2,10,96,3,2,2,,,,3,,,46,,,2,,,,1,8,1,8,1,7,2,,2,,2,,1,9,1,7,1,5,2,,1,10,1,10,2,1,1,1,1,3,12,11,2019,3,900,3,1,24,1,1,3,1,2,2,1,1,12,11,2019,,,,,,,3,99996,99996,99996,,,,,1,3,1,1,1,1,7,1,,,,17,,,1,3,10,1,120,1,1,1,1,1,2,,1,2,2,2,2,2,,,,6,5,7,5,6,6,5,1,2,,,,1,,,2,2,,,,2,,2,,2,,2,,2,,2,11,1,Aguascalientes,2,HGZ 1 Aguascalientes,706,1,1,2.666957732,2019-11-14,1
115668531,1,HGZ 1 Aguascalientes,11,14,11,2019,12,27,12,53,1,1,5,1,21,1,7,6,1,,,,,,3,2,2,2,2,2,2,4,7,97,0,40,,,2,2,13,,3,5,5,1,15,,3,,,42,,,5,4,2,,1,1,1,8,1,1,2,,2,,2,,1,8,1,2,2,,2,,2,,1,8,2,2,2,2,2,,13,11,2019,5,720,5,2,2,1,2,97,,,2,1,1,13,11,2019,,,,,,,3,99996,99996,99996,,,,,4,1,2,1,2,,1,3,5,,,1,24,,1,1,10,1,10,2,,,2,,3,3,1,2,2,2,2,2,,,,8,8,8,8,5,7,7,2,3,1,,,1,,,2,2,,,,2,,2,,2,,2,,2,,5,11,1,Aguascalientes,2,HGZ 1 Aguascalientes,706,1,1,2.666957732,2019-11-14,1
115670257,1,HGZ 1 Aguascalientes,11,14,11,2019,12,48,13,8,1,14,9999,2,48,2,1,3,2,1,2,8,2,,97,2,2,2,2,2,2,,,,,,,,,,,,,1,1,,,,4,,,49,,,2,,,,1,10,1,10,1,10,1,10,1,10,1,10,1,10,1,10,1,10,1,10,2,,1,10,1,1,1,1,2,,12,11,2019,1,20,2,1,2,1,1,2,1,2,2,2,,,,,,,,,,,,,,,,,,,,,,,,,,,,,,,,,2,,,,,1,3,1,1,1,2,,1,2,1,2,2,2,,,,10,10,10,10,99,99,10,1,2,,,,995,,,1,1,1,,,2,,2,,2,,2,,2,,2,11,1,Aguascalientes,2,HGZ 1 Aguascalientes,706,1,1,5.299598893,2019-11-14,1
115688961,1,HGZ 1 Aguascalientes,11,14,11,2019,15,34,15,48,1,1,2,1,59,1,5,1,1,,,,,,5,1,2,2,2,2,2,6,97,97,,,,,2,2,13,,2,2,2,,,,9,,,12,,,2,,,,1,9,1,9,2,,1,10,1,10,2,,2,,1,10,2,,2,,2,,2,,1,1,1,1,2,,12,11,2019,3,720,4,1,3,1,1,99,,,2,2,,,,,,,,,,,,,,,,,,,,,,,,,,,,,,,,,2,,,,,1,3,1,1,1,2,,1,1,2,2,2,2,,,,10,10,10,10,99,99,10,1,2,,,,20,,,1,1,1,,,2,,2,,2,,2,,2,,2,11,1,Aguascalientes,2,HGZ 1 Aguascalientes,706,1,1,4.77402769,2019-11-14,1
115547243,1,HGZ 2 Aguascalientes,12,13,11,2019,12,39,12,57,1,1,1,1,25,1,5,4,1,,,,,,97,2,2,2,2,2,2,5,97,97,,,,,2,2,6,11,2,2,2,,,,1,,,31,,,2,,,,1,10,1,8,1,8,1,10,2,,2,,2,,1,5,2,,2,,2,,1,9,1,1,1,1,2,,7,11,2019,4,360,3,1,2,1,1,3,1,2,1,1,1,12,11,2019,,,,,,,4,7,2,1,2,4,,,28,2,1,1,1,2,7,2,,,,995,,,1,3,3,1,5,1,1,1,1,1,1,,1,2,2,2,2,2,,,,9,10,8,8,8,9,8,1,2,,,,995,,,1,2,,,,2,,2,,2,,2,,2,,2,12,1,Aguascalientes,2,HGZ 2 Aguascalientes,520,2,1,3.27388579,2019-11-13,1
115549241,1,HGZ 2 Aguascalientes,12,13,11,2019,13,4,13,17,2,1,4,1,18,1,6,5,1,,,,,,3,2,2,2,2,2,2,,,,,,,,,,,,,2,2,,,,2,3,,42,42,,1,,,,1,10,1,10,2,,1,10,1,10,1,10,1,10,2,,1,10,2,,1,10,1,10,1,1,1,1,2,,11,11,2019,1,10,2,1,3,1,1,1,3,4,2,2,,,,,,,,,,,,,,,,,,,,,,,,,,,,,,,,,1,,8,1,5,1,3,1,1,1,2,,1,1,2,1,2,2,,,,9,6,9,9,99,99,8,1,2,,,,995,,,1,1,1,,,2,,2,,2,,2,,2,,1,12,1,Aguascalientes,2,HGZ 2 Aguascalientes,520,2,1,3.27388579,2019-11-13,1
115550961,1,HGZ 2 Aguascalientes,12,13,11,2019,13,10,13,32,1,1,4,2,54,1,9,5,2,1,2,17,4,,5,1,2,1,2,2,2,,,,,,,,,,,,,2,1,,,,17,2,13,45,,,1,,,,1,10,1,10,1,10,1,10,2,,2,,1,10,2,,2,,2,,2,,1,10,1,1,1,2,2,,13,11,2019,2,2,1,1,99,2,2,1,3,5,2,1,1,13,11,2019,,,,,,,2,360,3,12,1,,,,9,4,2,1,1,4,10,1,,,,1,24,,2,,,,,1,2,2,2,,2,,1,2,2,1,1,2,,,,10,10,10,10,99,10,10,1,1,,,,995,,,2,2,,,,2,,2,,2,,2,,2,,1,12,1,Aguascalientes,2,HGZ 2 Aguascalientes,520,2,1,5.742917541,2019-11-13,1
115564253,1,HGZ 2 Aguascalientes,12,13,11,2019,14,50,15,2,1,1,4,2,34,2,7,1,2,1,1,3,,,2,97,97,97,97,97,97,,,,,,,,,,,,,2,2,,,,4,,,31,,,2,,,,1,9,1,10,1,9,2,,1,9,2,,1,1,1,9,1,9,1,9,2,,2,,2,1,1,1,1,3,10,11,2019,3,1440,2,1,5,1,1,3,1,1,2,2,,,,,,,,,,,,,,,,,,,,,,,,,,,,,,,,,2,,,,,1,1,1,1,1,2,,1,2,1,2,1,2,,,,8,1,7,9,9,3,8,1,2,,,,1,2,,1,1,1,,,2,,2,,2,,2,,2,,2,12,1,Aguascalientes,2,HGZ 2 Aguascalientes,520,2,1,5.241527958,2019-11-13,1
115567708,1,HGZ 2 Aguascalientes,12,13,11,2019,15,25,15,43,1,1,2106,1,40,1,1,2,1,,,,,,1,2,2,2,2,2,2,5,5,97,0,30,,,2,2,13,,3,2,2,,,,1,,,53,,,1,,,,1,10,1,10,2,,1,10,2,,1,10,2,,2,,1,10,2,,2,,1,10,1,1,1,1,2,,11,11,2019,3,480,5,1,5,1,1,97,,,2,1,1,11,11,2019,,,,,,,3,99996,99996,99996,,,,,3,1,1,1,2,,10,1,,,,998,,,1,1,10,1,3,1,2,2,1,1,2,,1,1,1,1,1,2,,,,10,10,10,10,10,10,10,1,1,,,,29,4,16,1,1,1,,,2,,2,,2,,2,,2,,1,12,1,Aguascalientes,2,HGZ 2 Aguascalientes,520,2,1,5.755670967,2019-11-13,1
115573590,1,HGZ 2 Aguascalientes,12,13,11,2019,16,13,16,26,1,1,2106,3,21,1,7,6,2,7,1,74,99,9,6,1,1,2,2,2,2,5,97,97,,,,,1,1,13,,3,2,2,,,,26,,,29,,,1,,,,1,10,1,10,1,8,2,,2,,1,9,1,10,1,5,1,9,1,10,2,,1,10,1,1,1,1,2,,10,11,2019,3,2880,3,1,2,1,1,2,1,2,2,2,,,,,,,,,,,,,,,,,,,,,,,,,,,,,,,,,2,,,,,1,1,1,1,1,1,,1,2,99,2,99,2,,,,10,10,10,10,10,10,9,2,1,,,,24,,,1,1,1,,,2,,2,,2,,2,,2,,1,12,1,Aguascalientes,2,HGZ 2 Aguascalientes,520,2,1,3.27388579,2019-11-13,1
115577560,1,HGZ 2 Aguascalientes,12,13,11,2019,16,40,16,54,1,1,4,1,18,2,5,4,1,,,,,,1,2,2,2,2,2,2,,,,,,,,,,,,,2,2,,,,6,1,2,80,,,2,,,,1,10,1,10,2,,1,10,1,10,1,10,2,,2,,2,,2,,2,,2,,1,1,1,1,2,,10,11,2019,3,240,2,1,5,1,1,2,1,2,2,1,1,10,11,2019,,,,,,,3,1,1,1,1,,,,8,1,1,1,1,2,10,1,,,,995,,,1,2,8,1,10,1,1,1,1,1,2,,1,1,2,2,2,2,,,,10,10,10,10,10,10,10,1,2,,,,995,,,1,1,1,,,2,,2,,2,,2,,2,,2,12,1,Aguascalientes,2,HGZ 2 Aguascalientes,520,2,1,3.708696866,2019-11-13,1
115580443,1,HGZ 2 Aguascalientes,12,13,11,2019,16,59,17,16,2,1,4,1,37,1,9,5,1,,,,,,5,2,2,2,2,2,2,5,97,97,,,,,1,2,10,96,4,2,2,,,,1,,,127,,,2,,,,1,10,1,10,1,10,2,,2,,1,10,1,10,2,,2,,2,,2,,1,10,1,1,1,1,2,,12,11,2019,3,720,4,1,2,2,1,1,3,3,2,1,1,12,11,2019,,,,,,,3,99996,99996,99996,,,,,4,1,1,1,1,2,10,2,,,,995,,,2,,,,,1,3,1,1,1,2,,1,2,2,2,1,2,,,,10,10,5,10,10,10,10,1,2,,,,995,,,1,1,1,,,2,,2,,2,,2,,2,,2,12,1,Aguascalientes,2,HGZ 2 Aguascalientes,520,2,1,5.755670967,2019-11-13,1
115587328,1,HGZ 2 Aguascalientes,12,13,11,2019,17,33,17,48,1,1,4,1,60,2,2,1,1,,,,,,5,2,1,2,2,2,2,4,97,97,,,,,2,2,13,,5,2,1,,,,13,,,45,45,,2,,,,1,10,2,,2,,2,,2,,2,,2,,2,,2,,2,,2,,2,,1,1,1,1,1,998,13,11,2019,2,300,4,1,1,1,1,1,1,2,2,1,1,13,11,2019,,,,,,,2,5,1,5,1,,,,9,1,1,1,1,1,10,1,,,,995,,,2,,,,,1,3,1,1,1,99,,2,2,2,2,2,2,,,,10,10,10,10,10,99,10,1,1,,,,995,,,1,1,1,,,2,,2,,2,,2,,2,,1,12,1,Aguascalientes,2,HGZ 2 Aguascalientes,520,2,1,6.638808451,2019-11-13,1
115308624,1,HGZ 3 Aguascalientes,2093,11,11,2019,14,48,15,1,1,1,7,1,25,1,7,5,1,,,,,,3,2,2,2,2,2,2,6,7,97,0,20,,,2,2,13,,5,2,1,,,,3,,,46,,,1,,,,1,10,1,10,1,10,2,,2,,2,,1,10,2,,2,,2,,2,,1,10,1,1,1,1,2,,10,11,2019,1,10,2,1,8,1,1,4,1,2,2,2,,,,,,,,,,,,,,,,,,,,,,,,,,,,,,,,,1,,10,2,,1,1,1,1,1,5,999,1,1,1,1,1,2,,,,9,10,10,10,10,10,7,1,1,,,,995,,,2,2,,,,2,,2,,2,,2,,2,,2,2093,1,Aguascalientes,2,HGZ 3 Aguascalientes,496,3,1,28.10505032,2019-11-11,1
114839997,2,HGR 20 Tijuana,49,7,11,2019,9,53,10,14,1,2,22,1,32,1,2,2,1,,,,,,1,2,2,2,2,2,2,4,97,97,,,,,2,2,11,96,3,3,2,,,,1,,,53,,,1,,,,1,8,1,8,1,8,1,8,2,,1,10,1,8,2,,1,8,1,10,1,10,1,8,1,1,1,1,2,,30,10,2019,2,420,5,1,6,1,1,4,1,1,2,1,1,30,10,2019,,,,,,,2,120,3,4,1,,,,3,1,1,1,1,5,10,2,,,,1,13,,2,,,,,1,1,1,1,2,2,,1,2,2,2,1,2,,,,8,8,10,10,7,8,10,1,2,,,,995,,,1,1,1,,,2,,2,,2,,2,,2,,2,49,2,Baja California,2,HGR 20 Tijuana,728,1,0.289348172,54.96884339,2019-11-07,2
114865776,2,HGR 20 Tijuana,49,7,11,2019,12,44,13,21,1,2,22,1,68,2,5,1,1,,,,,,1,1,2,2,1,2,2,4,97,97,,,,,1,2,13,,4,1,1,,,,1,,,21,,,1,,,,1,10,1,10,1,10,1,9,1,7,2,,1,10,1,9,1,10,1,10,1,10,2,,1,1,1,1,2,,13,10,2019,3,720,5,1,20,1,1,4,1,2,2,1,1,2,11,2019,,,,,,,3,99996,99996,99996,,,,,33,3,1,1,1,2,8,2,,,,14,,,2,,,,,1,3,1,1,1,3,1,1,1,1,99,1,2,,,,8,7,7,8,99,8,7,1,2,,,,13,,,1,1,1,,,2,,2,,2,,2,,2,,2,49,2,Baja California,2,HGR 20 Tijuana,728,1,0.289348172,34.57608937,2019-11-07,2
114858648,2,HGZ 30 Mexicali,50,7,11,2019,12,5,12,22,1,2,19,1,49,1,3,5,1,,,,,,5,1,2,2,2,2,2,7,97,97,,,,,2,2,13,,1,2,2,,,,7,,,10,,,3,2,,,1,10,1,2,1,1,1,7,2,,1,5,1,8,2,,2,,2,,2,,2,,1,1,1,1,1,1,5,11,2019,1,240,4,1,7,1,1,2,1,2,2,2,,,,,,,,,,,,,,,,,,,,,,,,,,,,,,,,,1,,10,1,20,1,1,1,1,1,2,,2,1,1,2,1,2,,,,10,10,10,10,10,10,10,1,2,,,,995,,,1,1,1,,,2,,2,,2,,2,,2,,2,50,2,Baja California,2,HGZ 30 Mexicali,629,1,0.25,19.03524779,2019-11-07,2
114892510,2,HGZ 30 Mexicali,50,7,11,2019,16,18,16,31,1,2,21,1,48,2,5,2,1,,,,,,1,1,2,2,2,2,2,7,97,97,,,,,1,1,6,4,3,2,2,,,,13,,,7,,,2,,,,1,10,1,10,1,8,1,10,2,,2,,2,,1,9,2,,2,,2,,1,10,1,1,1,1,2,,6,11,2019,1,360,4,1,4,1,1,99,,,2,2,,,,,,,,,,,,,,,,,,,,,,,,,,,,,,,,,2,,,,,1,1,1,1,1,2,,1,2,2,2,1,2,,,,9,10,10,9,8,9,7,99,2,,,,995,,,1,1,1,,,2,,1,300,2,,2,,2,,2,50,2,Baja California,2,HGZ 30 Mexicali,629,1,0.25,15.79770302,2019-11-07,2
114893772,2,HGZ 30 Mexicali,50,7,11,2019,16,29,16,42,1,2,33,1,45,1,4,2,1,,,,,,1,2,2,2,2,2,2,4,97,97,,,,,2,2,13,,3,2,2,,,,1,,,49,,,2,,,,1,8,1,9,2,,1,9,2,,2,,2,,2,,2,,2,,2,,2,,1,1,1,1,2,,5,11,2019,2,2880,4,1,99,1,1,2,3,6,2,1,2,6,11,2019,6,11,2019,,,,4,99999,99999,99999,1,,,,19,1,1,1,1,2,7,2,,,,995,,,2,,,,,1,1,1,1,1,2,,1,1,1,1,1,2,,,,8,10,9,10,8,10,9,99,2,,,,999,,,2,2,,,,2,,2,,2,,2,,2,,2,50,2,Baja California,2,HGZ 30 Mexicali,629,1,0.25,19.03524779,2019-11-07,2
114898919,2,HGZ 30 Mexicali,50,7,11,2019,17,5,17,18,1,2,19,1,25,1,5,5,1,,,,,,5,1,2,2,2,1,2,5,97,97,,,,,2,2,13,,2,2,2,,,,6,,,2,,,2,,,,1,6,1,6,2,,2,,2,,2,,2,,2,,2,,2,,1,10,1,8,1,1,1,1,1,2,2,11,2019,2,15,4,1,8,1,1,4,1,1,1,1,1,2,11,2019,,,,,,,2,30,3,1,1,,,,18,2,2,1,1,1,8,1,,,,13,,,1,1,7,1,15,1,1,1,1,1,2,,1,2,1,2,1,2,,,,6,6,7,7,7,8,7,2,2,,,,17,,,1,2,,,,2,,2,,2,,2,,2,,2,50,2,Baja California,2,HGZ 30 Mexicali,629,1,0.25,23.53970687,2019-11-07,2
114901643,2,HGZ 30 Mexicali,50,7,11,2019,17,32,17,45,1,2,40,1,36,1,1,5,1,,,,,,5,1,2,2,2,1,2,5,97,97,,,,,2,2,13,,3,2,2,,,,1,9,,53,,,2,,,,1,8,1,6,1,7,2,,2,,2,,2,,2,,2,,2,,1,7,1,5,2,2,1,1,2,,31,10,2019,1,60,4,1,4,1,1,4,1,1,2,2,,,,,,,,,,,,,,,,,,,,,,,,,,,,,,,,,2,,,,,1,1,1,1,1,2,,1,2,1,1,1,2,,,,5,4,7,6,5,6,7,2,2,,,,18,,,1,1,1,,,2,,2,,2,,2,,2,,2,50,2,Baja California,2,HGZ 30 Mexicali,629,1,0.25,29.13860302,2019-11-07,2
114902231,2,HGZ 30 Mexicali,50,7,11,2019,17,40,17,53,1,2,19,1,65,2,3,5,1,,,,,,2,1,2,2,2,2,2,5,97,97,,,,,2,2,13,,3,3,3,17,,,7,,,10,,,2,,,,1,6,1,5,2,,2,,2,,2,,2,,2,,2,,2,,2,,2,,1,1,1,1,2,,25,10,2019,2,5,1,1,4,1,1,5,1,1,2,2,,,,,,,,,,,,,,,,,,,,,,,,,,,,,,,,,2,,,,,1,1,1,1,1,1,,2,2,1,1,1,2,,,,4,5,6,6,6,5,5,1,2,,,,10,18,,1,1,1,,,2,,2,,2,,2,,2,,2,50,2,Baja California,2,HGZ 30 Mexicali,629,1,0.25,11.52536312,2019-11-07,2
115405264,2,HGS 12 San Luis R�o Colorado,53,12,11,2019,11,6,11,19,1,2,24,1,54,1,4,5,1,,,,,,5,1,2,2,2,1,2,5,97,97,,,,,2,2,13,,2,2,2,,,,2,14,,9,11,,1,,,,2,,2,,1,8,2,,2,,1,8,2,,2,,2,,2,,2,,2,,2,2,2,2,2,,8,11,2019,2,120,5,2,2,2,2,5,1,2,2,2,,,,,,,,,,,,,,,,,,,,,,,,,,,,,,,,,2,,,,,2,,,99,,1,,1,2,1,1,1,2,,,,7,6,6,8,10,5,7,2,2,,,,1,16,,2,2,,,,2,,2,,2,,1,50,2,,2,53,2,Baja California,2,HGS 12 San Luis R�o Colorado,183,2,0.180473373,15.34319655,2019-11-12,2
115408018,2,HGS 12 San Luis R�o Colorado,53,12,11,2019,11,56,12,9,1,2,24,1,80,2,2,5,1,,,,,,5,1,2,2,2,2,2,6,97,97,,,,,2,2,13,,2,2,2,,,,2,,,10,,,2,,,,2,,2,,2,,2,,2,,2,,2,,2,,2,,2,,2,,2,,2,2,2,2,2,,9,11,2019,2,2,5,2,3,2,2,3,1,1,2,2,,,,,,,,,,,,,,,,,,,,,,,,,,,,,,,,,2,,,,,2,,,2,,1,,2,2,1,1,1,2,,,,8,6,9,8,6,8,8,1,2,,,,13,18,,2,2,,,,2,,2,,2,,2,,2,,2,53,2,Baja California,2,HGS 12 San Luis R�o Colorado,183,2,0.180473373,9.289919083,2019-11-12,2
115408894,2,HGS 12 San Luis R�o Colorado,53,12,11,2019,12,8,12,21,1,2,40,1,56,1,3,5,1,,,,,,6,1,2,2,1,2,2,6,97,97,,,,,2,2,13,,3,2,2,,,,1,,,49,,,2,,,,1,6,1,6,1,5,1,10,2,,2,,2,,2,,2,,2,,2,,1,8,1,1,1,1,2,,10,11,2019,2,180,3,1,3,1,1,99,,,2,2,,,,,,,,,,,,,,,,,,,,,,,,,,,,,,,,,2,,,,,1,3,1,1,1,2,,1,2,1,1,1,2,,,,9,4,3,7,9,99,7,1,2,,,,995,,,1,1,1,,,2,,2,,2,,2,,2,,2,53,2,Baja California,2,HGS 12 San Luis R�o Colorado,183,2,0.180473373,29.86436579,2019-11-12,2
114966537,2,HGPMF 31 Mexicali,58,8,11,2019,11,15,11,31,1,2,19,2,42,1,4,11,2,1,2,10,2,,5,2,2,2,2,1,2,,,,,,,,,,,,,2,2,,,,4,,,9,8,,2,,,,1,9,1,10,2,,2,,2,,2,,1,9,1,7,2,,2,,2,,1,6,1,1,1,1,2,,7,11,2019,4,240,3,1,3,1,1,3,1,1,2,2,,,,,,,,,,,,,,,,,,,,,,,,,,,,,,,,,1,,10,1,10,1,1,1,1,1,2,,1,1,1,1,1,2,,,,8,9,9,8,8,9,7,1,3,15,13,,995,,,2,2,,,,2,,2,,2,,2,,2,,2,58,2,Baja California,2,HGPMF 31 Mexicali,327,2,0.322485207,7.828972832,2019-11-08,2
114968074,2,HGPMF 31 Mexicali,58,8,11,2019,11,34,11,46,1,2,2042,1,28,1,6,11,1,,,,,,1,2,2,2,2,2,2,7,97,97,,,,,2,2,13,,2,2,2,,,,3,,,42,,,2,,,,1,10,1,9,1,8,1,8,2,,2,,1,8,2,,2,,2,,2,,1,8,1,1,1,1,2,,6,11,2019,1,540,4,1,2,1,1,2,1,2,2,2,,,,,,,,,,,,,,,,,,,,,,,,,,,,,,,,,2,,,,,1,2,1,1,1,2,,1,1,1,2,1,2,,,,10,9,9,8,99,9,9,1,2,,,,995,,,1,1,1,,,2,,2,,2,,2,,2,,2,58,2,Baja California,2,HGPMF 31 Mexicali,327,2,0.322485207,4.923017771,2019-11-08,2
114975649,2,HGPMF 31 Mexicali,58,8,11,2019,11,58,12,11,1,2,21,1,51,1,4,5,1,,,,,,5,1,1,2,2,1,2,5,97,97,,,,,2,2,13,,3,3,3,1,15,,1,,,32,,,3,8,,,1,4,1,6,2,,2,,2,,2,,2,,2,,2,,2,,2,,2,,2,2,2,2,2,,30,10,2019,2,60,5,1,2,1,1,3,1,2,1,2,,,,,,,,,,,,,,,,,,,,,,,,,,,,,,,,,1,,10,2,,1,1,1,1,2,3,1,2,2,1,1,1,2,,,,7,6,9,9,8,7,7,2,3,8,,,1,,,2,2,,,,2,,2,,2,,2,,2,,2,58,2,Baja California,2,HGPMF 31 Mexicali,327,2,0.322485207,5.114398849,2019-11-08,2
114975650,2,HGPMF 31 Mexicali,58,8,11,2019,12,7,12,20,1,2,40,2,36,1,2,5,2,1,2,17,5,,5,1,2,1,2,1,2,,,,,,,,,,,,,2,2,,,,1,,,54,,,2,,,,1,6,1,3,2,,2,,2,,2,,2,,2,,2,,2,,2,,2,,1,2,1,1,2,,5,11,2019,2,5,2,1,5,1,1,6,1,1,1,1,1,7,11,2019,,,,,,,1,21,2,3,1,,,,28,2,1,1,1,2,9,2,,,,6,,,2,,,,,1,1,1,1,1,2,,2,2,2,2,2,2,,,,8,9,8,8,9,8,8,2,2,,,,1,,,2,2,,,,2,,2,,2,,2,,2,,2,58,2,Baja California,2,HGPMF 31 Mexicali,327,2,0.322485207,7.828972832,2019-11-08,2
114979153,2,HGPMF 31 Mexicali,58,8,11,2019,12,46,12,59,1,2,33,2,28,1,5,2,2,1,1,0,,,5,2,2,2,2,2,2,,,,,,,,,,,,,2,2,,,,4,,,2,1,4,1,,,,1,10,1,9,1,9,1,7,2,,2,,2,,1,7,2,,1,9,2,,1,10,1,1,1,1,2,,6,11,2019,3,60,2,1,99,1,1,2,3,2,2,2,,,,,,,,,,,,,,,,,,,,,,,,,,,,,,,,,2,,,,,1,3,1,1,1,2,,1,2,2,1,2,2,,,,8,6,8,6,7,8,6,2,2,,,,19,,,1,1,1,,,2,,2,,2,,2,,2,,2,58,2,Baja California,2,HGPMF 31 Mexicali,327,2,0.322485207,4.923017771,2019-11-08,2
114992217,2,HGPMF 31 Mexicali,58,8,11,2019,14,16,14,36,1,2,45,1,29,1,7,2,1,,,,,,1,2,1,2,2,2,2,5,97,97,,,,,1,2,7,96,2,5,5,1,1,,1,,,46,,,5,4,,,2,,1,8,1,8,2,,2,,2,,2,,1,1,1,10,2,,1,8,1,5,1,2,2,2,1,8,5,11,2019,3,2880,5,1,4,1,1,97,,,2,1,1,7,11,2019,,,,,,,4,2,1,2,1,,,,1,1,2,1,2,,8,1,,,,1,1,,1,3,10,2,,1,3,1,1,1,1,,2,2,2,2,2,2,,,,5,5,5,5,99,99,5,1,4,18,,,32,1,1,1,2,,,,2,,2,,2,,2,,2,,4,58,2,Baja California,2,HGPMF 31 Mexicali,327,2,0.322485207,4.923017771,2019-11-08,2
115012469,2,HGPMF 31 Mexicali,58,8,11,2019,16,59,17,12,1,2,38,1,26,1,3,5,1,,,,,,5,2,2,2,2,2,2,7,97,97,,,,,2,2,13,,1,4,5,18,,,1,,,46,,,4,3,4,,1,4,1,7,2,,2,,2,,2,,2,,2,,2,,2,,2,,2,,2,2,2,1,1,3,6,11,2019,3,120,4,1,2,1,1,99,,,2,1,2,7,11,2019,7,11,2019,,,,4,99996,99996,99996,,,,,1,2,1,1,1,2,4,4,7,,,1,2,11,1,3,10,1,25,1,3,1,1,1,2,,2,2,2,2,2,2,,,,8,6,9,6,8,5,9,1,4,1,12,14,16,1,2,1,1,1,,,2,,2,,2,,2,,2,,2,58,2,Baja California,2,HGPMF 31 Mexicali,327,2,0.322485207,4.923017771,2019-11-08,2
115012470,2,HGPMF 31 Mexicali,58,8,11,2019,17,7,17,20,1,2,21,2,20,1,5,2,2,1,1,2,,,5,2,2,2,2,2,2,,,,,,,,,,,,,2,2,,,,4,,,3,,,2,,,,1,7,1,8,1,5,2,,2,,2,,2,,2,,2,,2,,2,,2,,1,1,1,1,2,,7,11,2019,1,60,2,1,3,1,1,3,1,1,2,2,,,,,,,,,,,,,,,,,,,,,,,,,,,,,,,,,2,,,,,1,3,1,1,1,2,,1,2,2,2,2,2,,,,8,9,10,7,9,8,8,1,2,,,,995,,,1,1,1,,,2,,2,,2,,2,,2,,2,58,2,Baja California,2,HGPMF 31 Mexicali,327,2,0.322485207,6.324658921,2019-11-08,2
115018214,2,HGPMF 31 Mexicali,58,8,11,2019,18,20,18,33,1,2,26,1,75,2,3,9,1,,,,,,5,1,2,2,2,2,2,5,97,97,,,,,2,2,13,,1,2,2,,,,7,,,5,,,2,,,,1,9,1,6,1,6,2,,2,,2,,2,,2,,2,,2,,2,,2,,2,2,2,1,2,,5,11,2019,2,5,1,1,2,1,1,2,1,1,2,2,,,,,,,,,,,,,,,,,,,,,,,,,,,,,,,,,2,,,,,1,1,1,1,1,2,,2,1,1,1,1,2,,,,6,6,6,5,8,7,4,2,2,,,,1,19,,1,1,1,,,2,,2,,2,,2,,2,,1,58,2,Baja California,2,HGPMF 31 Mexicali,327,2,0.322485207,3.096639694,2019-11-08,2
115682444,3,HGZMF 1 La Paz,88,14,11,2019,13,37,13,50,1,3,71,2,33,1,5,5,2,2,1,1,,,5,97,97,97,2,97,97,,,,,,,,,,,,,2,2,,,,6,,,93,,,1,,,,1,10,1,10,1,10,2,,2,,1,5,2,,2,,2,,2,,2,,1,10,1,1,1,1,1,999,9,11,2019,1,99997,,1,10,1,1,5,1,2,2,1,1,10,11,2019,,,,,,,2,99996,99996,99996,,,,,1,1,1,1,1,2,10,1,,,,995,,,1,2,10,1,5,1,2,1,1,1,2,,2,2,1,2,1,2,,,,10,10,10,9,99,10,10,1,1,,,,3,,,1,1,1,,,2,,2,,2,,2,,2,,1,88,3,Baja California Sur,2,HGZMF 1 La Paz,466,1,1,17.90063713,2019-11-14,3
115693559,3,HGZMF 1 La Paz,88,14,11,2019,15,11,15,27,1,3,73,2,32,1,5,5,2,2,1,0,,,5,97,97,97,97,97,97,,,,,,,,,,,,,1,1,,,,6,,,53,,,1,,,,1,10,1,10,99,,2,,2,,2,,1,10,1,1,1,10,2,,2,,1,10,1,1,1,1,2,,13,11,2019,3,5,1,1,3,1,1,5,1,2,2,2,,,,,,,,,,,,,,,,,,,,,,,,,,,,,,,,,2,,,,,1,3,1,1,1,99,,1,1,99,1,99,2,,,,10,10,10,10,10,10,99,99,1,,,,998,,,2,2,,,,2,,2,,2,,2,,2,,1,88,3,Baja California Sur,2,HGZMF 1 La Paz,466,1,1,17.90063713,2019-11-14,3
114860630,3,HGSMF 26 Cabo San Lucas,89,7,11,2019,13,25,13,44,1,3,77,1,81,2,1,9,1,,,,,,2,2,2,2,2,2,1,5,97,97,,,,,1,2,13,,3,3,2,,,,6,,,22,,,2,,,,1,9,1,9,1,5,1,8,2,,1,9,1,8,1,7,1,8,2,,2,,1,8,1,1,1,1,2,,6,11,2019,3,8640,4,1,5,1,1,1,1,2,2,2,,,,,,,,,,,,,,,,,,,,,,,,,,,,,,,,,2,,,,,1,1,1,1,1,2,,1,2,1,2,1,2,,,,10,10,10,8,9,10,8,1,2,,,,13,1,,1,1,1,,,2,,2,,2,,2,,2,,2,89,3,Baja California Sur,2,HGSMF 26 Cabo San Lucas,219,2,0.317851959,15.60651334,2019-11-07,3