Folio,Deleg,Unidmed,Id_Unid,Fecha_D,Fecha_M,Fecha_A,Hr_Ini_H,Hr_Ini_M,Hr_Fin_H,Hr_Fin_M,Lugaraplic,Edoproc,Id_Unidproc,Tipopac,Edad,Sexo,Escolar,Ocupa1,Identif_Enc,Parent_Pacm,Sexo_Pacm,Edad_Pacm,Escolar2,Ocupa2,Tipodhu,Discap_A,Discap_B,Discap_C,Discap_D,Discap_E,Discap_F,Fig_Corp,Act_Fis_Mod,Act_Fis_Vig,Tmp_Actfis_Mod_H,Tmp_Actfis_Mod_M,Tmp_Actfis_Vig_H,Tmp_Actfis_Vig_M,Fuma100,Fuma_Act,Frec_Alcohol,Exc_Alcohol,Estres,Sat1,Sat3,Sat3_Mot1,Sat3_Mot2,Sat3_Mot3,Servatn1_1,Servatn1_2,Servatn1_3,Probsal1,Probsal2,Probsal3,Btratou,Btratou_Mot1,Btratou_Mot2,Btratou_Mot3,Calfatna_A,Calfatnb_A,Calfatna_B,Calfatnb_B,Calfatna_C,Calfatnb_C,Calfatna_E,Calfatnb_E,Calfatna_G,Calfatnb_G,Calfatna_H,Calfatnb_H,Calfatna_N,Calfatnb_N,Calfatna_K,Calfatnb_K,Calfatna_L,Calfatnb_L,Calfatna_J,Calfatnb_J,Calfatna_Q,Calfatnb_Q,Calfatna_M,Calfatnb_M,Calfatna_F,Calfatnb_F,Mottratot1,Mottratot2,Mottratot3,Mottratot4,Mottratot5,Saludar,Escuchar,Responder,Amable,Comincom,Comincom_Mot,Pase,Totorpase1_M,Totorpase1_D,Tiem_Esp2,Tipocons,Tiempollegar,Tmllegarcalif,Tmedreg2,Caliemhoci,Tmcons,Durasis_C,Durasis_C1_A,Durasis_C1_B,Durasis_C1_C,Durasis_C1_D,Durasis_R1_A,Durasis_R1_B,Durasis_R1_C,Durasis_R1_D,Durasis_R1_E,Durasis_R1_F,Durasis_R1_G,Infoenferm,Infotratam,Infotratam2,Confmed_A,Confmed_B,Confmed_D,Confmed_E,Confmed_G,Dm,Hta,Ca,Ca_Tipo,Tamizajea,Tamizajea_Inst,Tamizajeb,Tamizajeb_Inst,Tamizajec,Tamizajec_Inst,Tamizajed,Tamizajed_Inst,Tamizajee,Tamizajee_Inst,Tamizajef,Tamizajef_Inst,Pap_P,Pap_N,Mast_P,Mast_N,Ec_Senos_P,Ec_Senos_N,Filtrosaux1,Temsad1_1,Temsad1_2,Temsad1b,Filtrosaux2,Temsad2_1,Temsad2_2,Temsad2b,Recmedhoy,Filtrofarm2,Totmed,Motnosurt,Acnomed,Calfinmb_F,Calfinmb_C3,Calfinmb_C2,Calfinmb_A1,Calfinmb_I,Calfinmb_J,Calfinmb_B1,Limp2,Gasto_Bolsilloa1,Gasto_Bolsillob1,Gasto_Bolsilloa2,Gasto_Bolsillob2,Gasto_Bolsilloa3,Gasto_Bolsillob3,Gasto_Bolsilloa4,Gasto_Bolsillob4,Cal1,Recomej_A,Recomej_B,Recomej_C,Id_Unidad,Cve_Delegaci�N,Delegaci�N,Nivel,Unidad,Promedio_Diario2018,Estrato,Moscondia,Fe_Finalnr,Fecha,Entidad
115379202,1,HGZ 1 Aguascalientes,11,12,11,2019,8,25,8,41,1,1,2041,1,65,2,7,9,1,,,,,,2,2,2,2,2,2,2,5,7,97,0,30,,,2,2,13,,5,2,2,,,,7,,,10,,,1,,,,1,10,2,,1,10,2,,2,,2,,1,10,2,,2,,2,,2,,2,,2,,,,,,,1,1,1,1,2,,1,30,0.020833333,150,2,300,2,60,2,30,1,1,1,1,1,2,2,2,1,1,2,2,1,1,1,1,1,1,1,2,1,1,2,,1,2,1,2,,,,,1,2,2,,,,,,,,2,,,,2,,,,1,1,1,,,10,10,10,10,99,99,99,99,2,,2,,2,,2,,1,995,,,11,1,Aguascalientes,2,HGZ 1 Aguascalientes,706,1,1,7.507164865,2019-11-12,1
115379416,1,HGZ 1 Aguascalientes,11,12,11,2019,8,28,8,41,1,1,2041,1,34,2,7,2,1,,,,,,1,2,2,2,2,2,2,5,7,7,2,0,4,0,1,2,8,96,4,1,1,,,,13,,,45,,,1,,,,1,10,2,,1,10,2,,2,,2,,1,10,2,,2,,2,,2,,2,,2,,,,,,,1,1,1,1,2,,2,,,,1,5,2,5,2,10,1,2,2,1,2,1,1,1,1,1,1,1,1,1,1,1,1,1,1,99,2,2,2,,2,,2,,2,,2,,2,,2,,,,,,,,2,,,,2,,,,1,1,1,,,9,9,8,10,10,10,97,,2,,2,,2,,2,,2,29,,,11,1,Aguascalientes,2,HGZ 1 Aguascalientes,706,1,1,8.879923549,2019-11-12,1
115388050,1,HGZ 1 Aguascalientes,11,12,11,2019,8,46,9,20,1,1,2,1,42,1,7,2,1,,,,,,1,2,1,2,2,2,2,3,97,97,,,,,1,2,8,96,1,3,2,,,,25,,,61,,,1,,,,1,10,2,,1,10,1,10,2,,2,,1,10,2,,2,,2,,2,,2,,2,,,,,,,1,1,1,1,2,,1,43200,30,360,1,20,2,120,5,20,1,1,1,1,1,1,1,1,2,2,2,2,1,1,1,1,1,1,1,2,2,2,2,,2,,2,,2,,2,,,,,,4,2,4,1,4,1,1,240,1,1,1,240,3,1,1,1,1,,,9,10,10,10,10,10,10,1,2,,2,,2,,2,,2,14,,,11,1,Aguascalientes,2,HGZ 1 Aguascalientes,706,1,1,9.539656642,2019-11-12,1
115388051,1,HGZ 1 Aguascalientes,11,12,11,2019,9,20,9,33,1,1,2,1,40,1,7,1,1,,,,,,5,2,2,2,2,2,2,5,97,97,,,,,1,1,8,11,1,2,2,,,,23,,,61,,,2,,,,1,10,2,,1,10,1,10,2,,2,,1,10,2,,2,,2,,2,,2,,2,,,,,,,1,1,1,1,2,,2,,,,2,15,2,150,2,15,1,1,1,1,1,2,2,2,1,2,1,2,1,1,1,1,1,1,1,1,2,2,2,,2,,2,,2,,1,1,,,,,4,1,3,4,4,2,1,90,90,1,1,90,90,1,1,1,1,,,9,9,9,99,10,10,9,1,2,,2,,2,,2,,2,14,,,11,1,Aguascalientes,2,HGZ 1 Aguascalientes,706,1,1,9.539656642,2019-11-12,1
115388052,1,HGZ 1 Aguascalientes,11,12,11,2019,9,31,9,44,1,1,2,1,47,1,5,5,1,,,,,,5,2,1,2,2,2,2,4,97,97,,,,,2,2,13,,1,2,2,,,,7,,,61,,,2,,,,2,,2,,1,9,2,,2,,2,,1,9,2,,2,,2,,2,,2,,2,,,,,,,1,1,1,1,2,,2,,,,2,15,2,30,2,20,1,1,1,1,1,2,2,2,1,2,2,2,1,1,1,1,1,1,1,99,2,2,2,,2,,2,,2,,2,,,,,,99999,99999,99999,99999,99997,99997,2,,,,2,,,,1,1,1,,,9,9,10,10,9,10,9,1,2,,2,,2,,2,,2,995,,,11,1,Aguascalientes,2,HGZ 1 Aguascalientes,706,1,1,8.080199562,2019-11-12,1
115388187,1,HGZ 1 Aguascalientes,11,12,11,2019,9,7,9,26,1,1,4,1,45,1,5,4,1,,,,,,1,2,2,2,2,2,2,6,97,97,,,,,2,2,10,10,2,2,2,,,,91,,,998,,,2,,,,2,,2,,1,10,1,10,2,,2,,1,10,2,,2,,2,,2,,2,,2,,,,,,,1,1,1,1,2,,1,15,0.010416667,16,2,30,2,30,2,20,2,,,,,,,,,,,,2,2,,2,1,1,1,1,1,1,2,,1,2,1,2,,,,,,,,,3,2,3,3,3,2,2,,,,2,,,,1,1,1,,,99,9,8,99,9,10,99,1,2,,2,,2,,2,,2,14,1,17,11,1,Aguascalientes,2,HGZ 1 Aguascalientes,706,1,1,8.080199562,2019-11-12,1
115388188,1,HGZ 1 Aguascalientes,11,12,11,2019,9,32,9,51,1,1,2041,1,76,1,2,5,1,,,,,,5,1,1,2,2,2,2,8,97,97,,,,,2,2,13,,1,1,1,,,,5,,,31,,,1,,,,1,10,1,10,1,10,1,10,2,,2,,1,10,2,,2,,2,,1,10,2,,2,,,,,,,1,1,1,1,2,,1,5,0.003472222,60,2,38,2,5,2,15,1,1,1,1,1,1,1,1,1,1,1,1,1,1,1,1,1,1,1,1,2,1,2,,2,,1,2,1,2,,,,,,,4,10,4,3,4,2,2,,,,2,,,,1,1,1,,,10,10,10,10,10,10,10,1,2,,2,,2,,2,,1,44,,,11,1,Aguascalientes,2,HGZ 1 Aguascalientes,706,1,1,7.334753163,2019-11-12,1
115388507,1,HGZ 1 Aguascalientes,11,12,11,2019,9,56,10,16,1,1,2,1,37,1,1,2,1,,,,,,1,2,2,2,2,2,2,2,7,97,0,20,,,2,2,10,10,1,1,1,,,,3,,,51,,,1,,,,2,,2,,1,10,1,10,2,,2,,1,10,2,,2,,2,,2,,2,,2,,,,,,,1,1,1,1,2,,1,10,0.006944444,2,1,60,1,180,5,10,1,1,1,1,1,1,1,1,1,2,2,2,1,1,1,1,1,1,1,1,2,2,2,,2,,2,,2,,2,,,,,,3,3,99997,99997,3,2,1,1,21,1,1,3,3,1,1,1,1,,,10,10,1,10,1,1,1,2,2,,2,,2,,2,,1,21,13,14,11,1,Aguascalientes,2,HGZ 1 Aguascalientes,706,1,1,9.539656642,2019-11-12,1
115389633,1,HGZ 1 Aguascalientes,11,12,11,2019,10,12,10,29,1,1,10,1,47,1,3,5,1,,,,,,5,2,2,2,2,2,2,7,7,97,1,0,,,1,2,13,,1,2,1,,,,2,,,999,,,2,,,,2,,2,,1,10,1,10,2,,2,,1,10,2,,2,,2,,2,,2,,2,,,,,,,1,1,1,1,2,,1,5,0.003472222,180,2,60,4,99999,,15,1,1,1,1,1,2,2,2,2,2,2,2,1,1,1,1,1,1,1,2,1,1,2,,2,,1,2,,,,,,,,,4,2,4,1,99997,99997,1,8,3,1,2,,,,1,1,1,,,10,10,10,10,10,10,10,1,2,,2,,2,,2,,2,995,,,11,1,Aguascalientes,2,HGZ 1 Aguascalientes,706,1,1,8.080199562,2019-11-12,1
115394151,1,HGZ 1 Aguascalientes,11,12,11,2019,10,39,10,56,1,1,2,1,71,2,3,9,1,,,,,,2,1,1,1,1,2,2,4,97,97,,,,,1,2,13,,3,1,1,,,,26,,,29,,,1,,,,1,10,2,,1,10,1,10,2,,2,,1,10,2,,2,,2,,2,,2,,2,,,,,,,1,1,1,1,2,,1,5,0.003472222,30,2,30,2,30,2,30,1,1,1,1,1,2,1,1,1,1,1,1,1,1,1,1,1,1,1,2,2,2,2,,1,1,1,1,1,1,1,1,2,,2,,,,,,,,1,1,7,1,1,1,99999,1,1,1,1,,,1,1,1,8,99,9,1,2,2,,2,,2,,2,,1,21,2,3,11,1,Aguascalientes,2,HGZ 1 Aguascalientes,706,1,1,7.507164865,2019-11-12,1
115394518,1,HGZ 1 Aguascalientes,11,12,11,2019,11,8,11,21,1,1,1,1,89,1,2,5,1,,,,,,5,1,1,2,2,2,2,5,7,97,0,20,,,1,2,13,,3,3,4,3,,,17,,,88,,,2,,,,1,9,1,9,1,10,2,,2,,2,,1,10,2,,2,,2,,2,,2,,2,,,,,,,1,1,1,1,2,,1,60,0.041666667,90,2,20,2,60,2,20,1,1,1,1,1,2,2,2,2,2,2,2,1,1,1,1,1,1,1,1,2,1,1,32,1,2,1,2,2,,,,,,,,99999,99999,99997,99997,4,10,1,30,15,1,1,60,30,1,1,1,1,,,10,8,9,10,9,9,8,1,2,,2,,2,,2,,2,4,,,11,1,Aguascalientes,2,HGZ 1 Aguascalientes,706,1,1,7.334753163,2019-11-12,1
115394608,1,HGZ 1 Aguascalientes,11,12,11,2019,10,30,10,43,1,1,2,1,47,1,4,2,1,,,,,,1,1,1,2,2,2,2,8,97,97,,,,,1,2,7,96,1,2,2,,,,3,,,77,,,2,,,,2,,2,,1,10,1,10,2,,2,,1,10,2,,2,,2,,2,,2,,2,,,,,,,1,1,1,1,2,,1,43200,30,30,1,35,99,240,4,15,1,1,2,1,2,2,2,2,2,1,2,2,1,1,3,2,1,97,1,1,1,1,1,32,1,1,1,1,,,,,,,,,99999,99999,4,1,99997,99997,2,,,,2,,,,1,1,1,,,8,8,7,9,8,9,97,,2,,2,,2,,2,,2,15,1,,11,1,Aguascalientes,2,HGZ 1 Aguascalientes,706,1,1,8.080199562,2019-11-12,1
115394609,1,HGZ 1 Aguascalientes,11,12,11,2019,10,52,11,6,1,1,5,1,63,1,5,2,1,,,,,,1,2,2,2,2,2,2,5,7,97,8,0,,,2,2,7,5,5,99,2,,,,21,,,6,,,2,,,,2,,2,,1,10,1,10,2,,2,,1,10,2,,2,,2,,2,,2,,2,,,,,,,1,1,1,1,2,,2,,,,2,12,2,180,4,15,1,1,1,1,1,2,2,2,2,2,2,2,1,1,1,1,1,1,1,2,2,1,2,,2,,2,,2,,,,,,,,99997,99997,99997,99997,99997,99997,2,,,,2,,,,1,1,1,,,10,10,10,9,9,6,9,1,2,,2,,2,,2,,2,3,9,,11,1,Aguascalientes,2,HGZ 1 Aguascalientes,706,1,1,7.510889759,2019-11-12,1
115394610,1,HGZ 1 Aguascalientes,11,12,11,2019,11,7,11,21,1,1,5,1,22,2,7,1,1,,,,,,1,2,2,2,2,2,2,7,7,2,0,20,1,0,1,1,7,5,1,2,1,,,,28,,,111,,,1,,,,1,8,2,,1,10,2,,2,,2,,1,10,2,,2,,2,,2,,2,,2,,,,,,,1,1,1,1,2,,1,5,0.003472222,15,1,15,2,120,4,60,2,,,,,,,,,,,,1,1,1,1,1,1,1,2,1,2,2,,1,2,1,2,,,1,2,2,,2,,,,,,,,2,,,,2,,,,1,1,1,,,8,7,6,10,10,5,97,,2,,2,,2,,2,,2,995,,,11,1,Aguascalientes,2,HGZ 1 Aguascalientes,706,1,1,8.901201436,2019-11-12,1
115394972,1,HGZ 1 Aguascalientes,11,12,11,2019,11,7,11,25,1,1,2,1,72,2,3,9,1,,,,,,2,1,1,2,2,2,2,7,97,97,,,,,1,2,13,,5,2,1,,,,28,,,13,,,1,,,,1,10,2,,1,10,1,9,2,,2,,1,10,2,,2,,2,,2,,2,,2,,,,,,,1,1,1,1,2,,1,10,0.006944444,360,2,10,2,45,2,15,1,1,2,2,2,2,2,2,2,2,2,2,2,2,,2,1,1,1,2,2,1,2,,2,,1,1,1,1,,,1,1,2,,,,,,,,2,,,,2,,,,1,1,1,,,10,10,10,10,10,10,10,1,2,,2,,2,,2,,1,1,14,13,11,1,Aguascalientes,2,HGZ 1 Aguascalientes,706,1,1,7.507164865,2019-11-12,1
115395851,1,HGZ 1 Aguascalientes,11,12,11,2019,11,21,11,34,1,1,2041,1,26,2,4,4,1,,,,,,1,1,2,2,2,2,2,4,7,97,12,0,,,1,1,13,,5,2,2,,,,29,,,66,,,1,,,,2,,2,,1,10,2,,2,,2,,1,10,2,,2,,2,,2,,2,,2,,,,,,,1,1,2,2,2,,1,99999,99999,99999,2,25,2,120,2,20,1,1,1,1,1,2,2,2,2,2,2,2,1,1,1,1,1,1,1,2,2,2,1,6,2,,2,,2,,2,,2,,2,,,,,,,,2,,,,2,,,,1,1,1,,,10,10,1,10,99,10,99,99,2,,2,,2,,2,,1,22,,,11,1,Aguascalientes,2,HGZ 1 Aguascalientes,706,1,1,8.879923549,2019-11-12,1
115396235,1,HGZ 1 Aguascalientes,11,12,11,2019,11,23,11,38,1,1,2041,1,39,1,3,1,1,,,,,,5,2,2,2,2,2,2,3,97,97,,,,,2,2,6,8,1,2,3,17,,,2,,,51,,,2,,,,1,10,2,,1,10,2,,1,10,2,,1,10,2,,2,,2,,2,,2,,2,,,,,,,1,1,1,1,2,,1,20,0.013888889,30,1,25,3,240,4,20,1,1,1,1,1,2,2,2,2,2,2,2,1,1,1,1,1,1,1,2,1,1,2,,1,2,1,1,,,,,,,,,4,1,99997,99997,4,1,1,120,90,1,2,,,,1,1,2,98,1,9,7,10,99,99,10,99,99,2,,2,,2,,2,,2,3,,,11,1,Aguascalientes,2,HGZ 1 Aguascalientes,706,1,1,9.539656642,2019-11-12,1
115397604,1,HGZ 1 Aguascalientes,11,12,11,2019,11,35,11,51,1,1,1,1,73,1,2,5,1,,,,,,5,1,1,2,2,2,2,5,97,97,,,,,1,2,13,,1,5,5,17,,,23,,,61,,,99,,,,1,10,2,,1,10,2,,2,,2,,1,9,2,,2,,2,,2,,2,,2,,,,,,,99,1,1,1,2,,2,,,,1,10,2,99999,,25,2,,,,,,,,,,,,2,97,,2,99,97,97,99,2,1,2,,2,,2,,2,,,,,,,,99999,99999,99999,99999,99997,99997,1,6,99996,97,2,,,,1,1,1,,,8,8,99,10,99,99,97,,2,,2,,2,,2,,1,13,,,11,1,Aguascalientes,2,HGZ 1 Aguascalientes,706,1,1,7.334753163,2019-11-12,1
115398534,1,HGZ 1 Aguascalientes,11,12,11,2019,11,48,12,1,1,1,2,1,34,1,9,2,1,,,,,,1,2,2,2,2,2,2,4,97,97,,,,,2,2,13,,1,1,1,,,,23,,,61,,,1,,,,1,10,2,,1,10,2,,2,,2,,1,10,2,,2,,2,,2,,2,,2,,,,,,,1,1,1,1,2,,2,,,,2,20,2,30,2,30,1,1,1,1,1,1,1,1,1,1,1,1,1,1,1,1,1,1,1,2,2,1,2,,2,,2,,2,,,,,,,,3,6,99997,99997,99997,99997,2,,,,2,,,,1,1,1,,,10,9,9,10,10,9,97,,2,,2,,2,,2,,1,15,,,11,1,Aguascalientes,2,HGZ 1 Aguascalientes,706,1,1,8.675984677,2019-11-12,1
115398677,1,HGZ 1 Aguascalientes,11,12,11,2019,11,49,12,2,1,1,5,1,46,1,5,5,1,,,,,,5,1,1,2,2,2,2,5,3,97,1,0,,,2,2,12,96,1,2,2,,,,28,9,,109,,,2,,,,2,,2,,1,8,1,8,2,,2,,1,8,2,,2,,2,,2,,2,,2,,,,,,,1,1,1,1,2,,1,43200,30,30,2,60,3,180,4,15,1,2,2,1,1,2,2,2,2,2,2,2,1,1,2,1,1,1,1,1,2,1,2,,1,2,2,,2,,,,,,,,3,1,4,1,3,1,2,,,,2,,,,2,1,1,,,8,8,8,8,9,9,8,1,2,,2,,2,,2,,3,24,1,,11,1,Aguascalientes,2,HGZ 1 Aguascalientes,706,1,1,8.080199562,2019-11-12,1
115400708,1,HGZ 1 Aguascalientes,11,12,11,2019,12,7,12,20,1,1,2041,2,39,2,5,1,2,1,1,15,4,,5,2,2,2,2,2,2,,,,,,,,,,,,,2,2,,,,25,,,9,,,1,,,,1,9,2,,1,10,2,,2,,2,,1,10,2,,2,,2,,2,,2,,2,,,,,,,1,1,1,1,2,,1,20,0.013888889,1,1,20,3,10,3,20,2,,,,,,,,,,,,1,1,1,1,1,1,1,2,,,,,,,,,,,,,,,,,,,,,,,2,,,,2,,,,1,1,1,,,10,10,10,10,10,10,9,1,2,,2,,2,,2,,1,14,1,,11,1,Aguascalientes,2,HGZ 1 Aguascalientes,706,1,1,9.763897105,2019-11-12,1
115403342,1,HGZ 1 Aguascalientes,11,12,11,2019,11,39,11,59,1,1,2,1,64,2,3,2,1,,,,,,1,1,2,2,2,2,2,6,97,97,,,,,2,2,13,,5,2,2,,,,9,9,,13,12,47,1,,,,1,10,2,,1,10,2,,2,,1,10,2,,2,,2,,2,,2,,2,,2,,,,,,,1,1,1,1,2,,2,,,,2,10,2,120,3,15,1,1,2,1,1,2,2,2,1,1,1,1,1,1,1,1,1,1,1,2,1,1,2,,2,,1,1,,,,,2,,2,,,,,,,,1,1,8,1,2,,,,2,2,,,,10,10,8,9,10,10,10,1,2,,2,,2,,2,,1,1,1,,11,1,Aguascalientes,2,HGZ 1 Aguascalientes,706,1,1,7.687441752,2019-11-12,1
115403343,1,HGZ 1 Aguascalientes,11,12,11,2019,12,16,12,40,1,1,4,1,65,2,5,10,1,,,,,,1,2,2,2,1,2,2,6,7,97,0,40,,,2,2,13,,5,2,2,,,,17,,,31,,,2,,,,1,8,2,,1,8,2,,2,,2,,2,,2,,2,,2,,2,,2,,2,,,,,,,1,1,1,1,2,,1,10,0.006944444,180,2,45,4,120,4,18,1,1,1,1,1,2,2,2,1,1,2,2,1,1,1,1,2,1,1,1,1,2,2,,2,,1,2,,,1,2,2,,2,,,,,,,,1,30,60,1,1,2,2,1,2,2,,,,10,10,10,10,10,6,10,1,2,,2,,2,,2,,2,1,21,18,11,1,Aguascalientes,2,HGZ 1 Aguascalientes,706,1,1,7.507164865,2019-11-12,1
115411109,1,HGZ 1 Aguascalientes,11,12,11,2019,13,7,13,20,1,1,10,1,45,2,1,5,1,,,,,,5,2,2,1,2,1,1,6,7,97,6,0,,,2,2,13,,2,2,2,,,,17,,,61,,,2,,,,2,,2,,1,9,1,10,2,,2,,1,9,2,,2,,2,,2,,2,,2,,,,,,,1,1,1,1,2,,1,86400,60,2,2,30,3,180,5,15,2,,,,,,,,,,,,1,1,1,1,1,1,1,1,2,2,2,,2,,2,,2,,2,,2,,2,,,,,,,,2,,,,2,,,,1,1,1,,,9,9,10,10,10,10,10,1,2,,2,,2,,2,,2,13,,,11,1,Aguascalientes,2,HGZ 1 Aguascalientes,706,1,1,8.270133829,2019-11-12,1
115411110,1,HGZ 1 Aguascalientes,11,12,11,2019,13,32,13,45,1,1,4,1,52,1,9,9,1,,,,,,2,1,2,2,2,2,2,7,7,97,0,30,,,2,2,13,,4,1,1,,,,65,,,61,,,1,,,,2,,2,,1,10,1,10,2,,2,,1,10,2,,2,,2,,2,,2,,2,,,,,,,1,1,1,1,2,,1,15,0.010416667,120,1,15,3,15,3,30,1,1,2,2,1,2,2,2,2,2,2,2,1,1,1,1,1,1,1,2,1,1,2,,1,2,1,2,,,,,,,,,4,1,4,1,4,1,2,,,,2,,,,1,1,1,,,10,10,10,7,99,10,99,99,2,,2,,2,,2,,1,1,,,11,1,Aguascalientes,2,HGZ 1 Aguascalientes,706,1,1,8.080199562,2019-11-12,1
115411165,1,HGZ 1 Aguascalientes,11,12,11,2019,12,42,13,11,1,1,3,1,74,1,2,9,1,,,,,,2,1,2,2,2,2,2,4,97,97,,,,,2,2,13,,5,1,1,,,,65,31,,61,,,1,,,,1,10,2,,1,10,1,10,2,,2,,1,10,2,,2,,2,,2,,2,,2,,,,,,,1,1,1,1,2,,1,86400,60,90,1,120,2,120,2,2,1,1,1,1,1,2,2,2,2,2,2,2,97,1,1,1,1,1,1,1,2,2,2,,2,,2,,2,,2,,,,,,99999,99999,99999,99999,99997,99997,1,90,90,1,2,,,,1,1,1,,,10,10,10,10,10,10,97,,2,,2,,2,,2,,1,995,,,11,1,Aguascalientes,2,HGZ 1 Aguascalientes,706,1,1,7.334753163,2019-11-12,1
115411166,1,HGZ 1 Aguascalientes,11,12,11,2019,13,25,13,38,1,1,5,1,22,2,4,6,1,,,,,,4,1,2,2,2,1,2,5,2,97,4,0,,,2,1,13,,5,1,2,,,,1,,,18,,,1,,,,1,10,2,,1,10,1,7,2,,2,,1,10,2,,2,,2,,2,,2,,2,,,,,,,1,1,1,1,2,,1,21600,15,5,2,10,2,480,4,20,1,1,1,1,1,2,2,2,2,2,2,2,1,1,1,1,1,1,1,1,2,2,2,,2,,2,,2,,2,,2,,2,,,,,,,,2,,,,2,,,,1,1,1,,,10,10,10,10,10,6,9,1,2,,2,,2,,2,,1,995,,,11,1,Aguascalientes,2,HGZ 1 Aguascalientes,706,1,1,8.901201436,2019-11-12,1
115413576,1,HGZ 1 Aguascalientes,11,12,11,2019,13,46,13,59,1,1,2,1,56,1,9,9,1,,,,,,2,1,2,2,2,2,2,5,7,97,0,30,,,2,2,13,,4,1,1,,,,2,,,49,,,1,,,,2,,1,9,1,10,2,,2,,2,,1,10,2,,1,9,1,10,2,,2,,1,10,,,,,,1,1,1,1,2,,1,21600,15,15,2,15,3,15,3,30,2,,,,,,,,,,,,1,1,1,1,1,1,1,2,2,2,2,,1,1,1,1,1,1,2,,,,,,3,2,3,6,3,6,2,,,,2,,,,1,1,1,,,9,9,9,9,9,9,8,1,2,,2,,2,,2,,1,995,,,11,1,Aguascalientes,2,HGZ 1 Aguascalientes,706,1,1,7.510889759,2019-11-12,1
115422898,1,HGZ 1 Aguascalientes,11,12,11,2019,14,14,14,28,1,1,2,1,61,1,9,9,1,,,,,,2,2,1,2,1,2,2,4,4,97,0,45,,,2,2,13,,3,2,1,,,,25,,,97,,,1,,,,2,,2,,1,10,1,10,2,,2,,1,9,2,,2,,2,,2,,2,,2,,,,,,,1,1,1,1,2,,2,,,,1,10,2,180,5,20,1,2,2,1,2,2,1,1,2,2,2,2,1,1,1,1,1,1,1,2,2,2,2,,2,,1,2,1,2,1,2,,,,,4,1,4,1,4,1,1,6,99997,1,1,99997,99997,1,1,1,1,,,9,9,9,10,10,10,99,99,2,,2,,2,,2,,2,24,,,11,1,Aguascalientes,2,HGZ 1 Aguascalientes,706,1,1,7.510889759,2019-11-12,1
115422899,1,HGZ 1 Aguascalientes,11,12,11,2019,14,29,14,46,1,1,2,3,62,1,1,5,2,2,2,25,1,8,5,2,2,2,2,2,2,7,97,97,,,,,1,1,13,,1,2,2,,,,28,,,69,,,2,,,,2,,2,,1,10,2,,2,,2,,1,10,2,,2,,2,,2,,2,,2,,,,,,,1,1,1,1,2,,1,99999,99999,60,2,25,3,300,3,30,1,2,2,2,2,2,2,2,2,2,2,2,1,1,1,1,1,1,1,1,2,2,2,,1,1,1,1,2,,2,,2,,2,,,,,,,,2,,,,2,,,,1,1,1,,,10,10,10,10,5,10,10,1,2,,2,,2,,2,,2,3,,,11,1,Aguascalientes,2,HGZ 1 Aguascalientes,706,1,1,7.510889759,2019-11-12,1
115424979,1,HGZ 1 Aguascalientes,11,12,11,2019,14,51,15,5,1,1,2,1,64,2,9,9,1,,,,,,2,1,2,2,1,2,2,4,7,97,1,0,,,2,2,5,96,3,2,1,,,,27,,,36,,,1,,,,2,,2,,1,10,2,,1,10,2,,1,10,2,,2,,2,,2,,2,,2,,,,,,,2,1,1,1,2,,1,86400,60,22,2,30,3,120,5,15,1,1,1,1,2,2,2,2,2,2,2,2,1,1,1,1,1,1,1,2,1,1,2,,2,,1,1,,,,,1,1,2,,,,,,,,1,15,15,1,2,,,,1,1,1,,,7,7,8,10,99,4,7,1,2,,2,,2,,2,,1,1,,,11,1,Aguascalientes,2,HGZ 1 Aguascalientes,706,1,1,7.687441752,2019-11-12,1
115427557,1,HGZ 1 Aguascalientes,11,12,11,2019,15,29,15,46,1,1,2,1,67,1,3,5,1,,,,,,5,2,2,2,2,2,2,7,7,97,1,0,,,2,2,13,,3,3,2,,,,27,,,18,,,2,,,,2,,2,,1,10,2,,2,,2,,1,10,2,,2,,2,,2,,2,,2,,,,,,,1,1,1,1,2,,1,99999,99999,30,1,15,3,60,4,10,2,,,,,,,,,,,,2,1,1,1,1,1,1,2,1,1,2,,1,1,1,1,,,,,,,,,4,1,99999,99999,99997,99997,2,,,,2,,,,1,1,1,,,5,8,8,99,10,9,8,1,2,,2,,2,,2,,2,19,,,11,1,Aguascalientes,2,HGZ 1 Aguascalientes,706,1,1,7.334753163,2019-11-12,1
115430195,1,HGZ 1 Aguascalientes,11,12,11,2019,15,55,16,8,1,1,5,2,47,1,3,5,2,1,1,11,3,,5,2,2,2,2,2,2,,,,,,,,,,,,,1,1,,,,4,,,21,,,2,,,,1,9,2,,1,10,1,10,2,,2,,2,,2,,2,,2,,2,,2,,2,,,,,,,2,1,1,1,2,,2,,,,2,40,2,60,4,15,2,,,,,,,,,,,,2,2,,2,99,1,1,1,,,,,,,,,,,,,,,,,,,,,,,2,,,,2,,,,2,2,,,,8,8,8,8,99,9,97,,2,,2,,2,,2,,2,995,,,11,1,Aguascalientes,2,HGZ 1 Aguascalientes,706,1,1,8.080199562,2019-11-12,1
115432875,1,HGZ 1 Aguascalientes,11,12,11,2019,15,59,16,14,1,1,5,1,59,1,7,1,1,,,,,,5,2,1,2,2,2,2,6,2,97,0,30,,,2,2,13,,4,2,1,,,,7,,,10,,,2,,,,1,9,2,,1,9,2,,2,,2,,1,9,2,,2,,2,,2,,2,,1,8,,,,,,1,1,1,1,2,,2,,,,2,15,4,120,3,8,2,,,,,,,,,,,,2,1,1,1,1,1,1,1,2,1,2,,1,2,1,7,2,,,,,,,,3,3,4,1,99997,99997,2,,,,2,,,,1,1,1,,,10,10,10,10,99,10,10,1,2,,2,,2,,2,,2,1,,,11,1,Aguascalientes,2,HGZ 1 Aguascalientes,706,1,1,7.510889759,2019-11-12,1
115433331,1,HGZ 1 Aguascalientes,11,12,11,2019,16,20,16,35,1,1,1,1,73,1,4,9,1,,,,,,2,2,2,2,2,2,2,9,7,97,0,30,,,1,2,13,,2,1,1,,,,21,,,61,,,1,,,,1,10,2,,1,10,2,,2,,2,,1,9,2,,2,,2,,2,,2,,2,,,,,,,1,1,1,1,2,,1,20,0.013888889,180,2,30,3,420,5,20,2,,,,,,,,,,,,1,1,1,1,1,1,2,2,2,1,2,,2,,2,,2,,,,,,,,4,1,2,1,2,1,2,,,,2,,,,1,1,3,2,2,10,10,10,10,10,10,10,1,2,,2,,2,,2,,1,995,,,11,1,Aguascalientes,2,HGZ 1 Aguascalientes,706,1,1,7.334753163,2019-11-12,1
115438007,1,HGZ 1 Aguascalientes,11,12,11,2019,14,39,14,54,1,1,2,1,58,1,5,5,1,,,,,,2,2,2,2,2,2,2,7,7,97,0,20,,,2,2,13,,1,1,2,,,,7,,,10,,,1,,,,2,,2,,1,10,2,,2,,2,,1,10,2,,2,,2,,2,,2,,2,,,,,,,1,1,1,1,2,,2,,,,1,60,4,20,2,20,2,,,,,,,,,,,,1,1,1,1,1,1,1,2,2,1,2,,2,,1,1,2,,,,,,,,3,6,3,6,3,6,1,15,15,1,1,5,5,2,1,1,1,,,7,6,5,10,10,10,10,1,2,,2,,2,,2,,2,995,,,11,1,Aguascalientes,2,HGZ 1 Aguascalientes,706,1,1,7.510889759,2019-11-12,1
115439270,1,HGZ 1 Aguascalientes,11,12,11,2019,16,39,16,52,1,1,5,1,72,1,5,5,1,,,,,,2,2,2,2,2,2,2,4,7,97,0,15,,,1,2,13,,5,4,3,8,,,9,,,68,,,3,15,,,1,10,2,,1,8,2,,2,,2,,1,10,2,,2,,2,,2,,2,,2,,,,,,,2,1,2,2,2,,1,518400,360,360,2,15,3,240,5,15,2,,,,,,,,,,,,1,1,1,1,2,1,2,2,2,2,2,,1,1,2,,2,,1,2,,,,,99997,99997,99999,99999,99997,99997,2,,,,2,,,,1,1,1,,,6,8,8,8,9,9,9,1,2,,2,,2,,2,,3,995,,,11,1,Aguascalientes,2,HGZ 1 Aguascalientes,706,1,1,7.334753163,2019-11-12,1
115439271,1,HGZ 1 Aguascalientes,11,12,11,2019,17,6,17,19,1,1,2,2,30,1,7,2,2,1,1,2,,,5,2,2,1,2,2,2,,,,,,,,,,,,,2,2,,,,4,,,85,,,1,,,,1,10,2,,1,10,2,,2,,2,,1,10,2,,2,,2,,2,,2,,2,,,,,,,1,1,1,1,2,,1,15,0.010416667,3,1,15,3,60,3,15,1,1,1,1,1,1,1,1,2,2,2,2,1,1,1,1,1,1,1,2,,,,,,,,,,,,,,,,,,,,,,,2,,,,2,,,,1,1,1,,,9,8,8,8,99,10,99,99,2,,2,,2,,2,,1,995,,,11,1,Aguascalientes,2,HGZ 1 Aguascalientes,706,1,1,8.675984677,2019-11-12,1
115440895,1,HGZ 1 Aguascalientes,11,12,11,2019,17,1,17,14,1,1,2,1,23,1,6,5,1,,,,,,5,2,2,2,2,2,2,4,5,97,0,30,,,2,2,13,,4,2,2,,,,7,,,61,,,1,,,,1,10,2,,1,10,2,,2,,2,,1,10,2,,2,,2,,2,,2,,2,,,,,,,1,1,1,1,2,,1,15,0.010416667,90,2,30,2,30,2,20,1,1,1,1,1,2,2,2,1,2,2,2,1,1,1,1,1,1,1,2,2,2,2,,2,,1,1,1,1,2,,,,,,4,1,99997,99997,4,1,1,99997,99996,1,2,,,,1,1,1,,,10,10,10,10,10,10,97,,2,,2,,2,,2,,1,995,,,11,1,Aguascalientes,2,HGZ 1 Aguascalientes,706,1,1,8.696773889,2019-11-12,1
115440896,1,HGZ 1 Aguascalientes,11,12,11,2019,17,9,17,22,1,1,2041,1,50,2,5,10,1,,,,,,1,2,2,2,2,2,2,5,97,97,,,,,1,2,5,5,1,2,2,,,,7,,,61,,,2,,,,1,8,2,,1,10,2,,2,,2,,1,10,2,,2,,2,,2,,2,,2,,,,,,,1,1,1,1,2,,1,43200,30,30,1,20,2,15,2,5,1,1,1,1,1,2,2,2,1,2,2,2,1,1,1,1,1,1,1,2,2,1,2,,1,2,1,2,1,2,,,2,,2,,,,,,,,2,,,,2,,,,1,1,1,,,10,10,10,10,10,10,97,,2,,2,,2,,2,,2,995,,,11,1,Aguascalientes,2,HGZ 1 Aguascalientes,706,1,1,8.270133829,2019-11-12,1
115440897,1,HGZ 1 Aguascalientes,11,12,11,2019,17,22,17,35,1,1,4,1,58,1,5,5,1,,,,,,5,2,2,2,2,2,2,5,5,97,1,0,,,1,2,13,,1,2,2,,,,23,,,11,,,2,,,,2,,2,,1,10,1,10,2,,2,,1,10,2,,2,,2,,2,,2,,2,,,,,,,1,1,1,1,2,,2,,,,2,40,3,30,2,30,1,1,1,1,1,2,2,2,2,2,2,2,1,1,1,1,1,1,1,1,2,2,2,,2,,1,2,2,,2,,,,,,4,1,99997,99997,99997,99997,2,,,,2,,,,1,1,1,,,10,10,10,10,10,99,10,1,2,,2,,2,,2,,2,995,,,11,1,Aguascalientes,2,HGZ 1 Aguascalientes,706,1,1,7.510889759,2019-11-12,1
115441400,1,HGZ 1 Aguascalientes,11,12,11,2019,17,24,17,39,1,1,2041,1,62,1,5,5,1,,,,,,2,1,1,1,1,2,2,4,5,97,1,0,,,2,2,13,,5,2,2,,,,2,,,38,,,2,,,,1,9,2,,1,9,2,,2,,2,,1,9,2,,2,,2,,2,,2,,2,,,,,,,1,1,1,1,2,,1,99999,99999,30,1,60,99,120,4,15,2,,,,,,,,,,,,2,1,1,1,1,1,1,1,2,1,2,,2,,2,,2,,,,,,,,3,3,99997,99997,99997,99997,1,99999,99999,1,1,99999,99999,1,1,1,1,,,8,99,99,9,99,9,9,1,2,,2,,2,,2,,2,17,,,11,1,Aguascalientes,2,HGZ 1 Aguascalientes,706,1,1,7.510889759,2019-11-12,1
115445866,1,HGZ 1 Aguascalientes,11,12,11,2019,17,42,17,55,1,1,2,1,64,1,3,2,1,,,,,,1,2,1,2,2,2,2,3,7,97,0,30,,,1,2,13,,3,2,2,,,,21,,,49,,,2,,,,1,10,2,,1,9,2,,2,,2,,1,9,2,,2,,2,,2,,2,,2,,,,,,,1,1,1,1,2,,1,20,0.013888889,180,2,25,4,240,4,15,1,2,2,2,2,2,2,2,2,2,2,2,1,1,1,1,2,1,1,1,1,2,2,,2,,1,1,,,2,,,,,,4,2,4,2,3,1,1,180,180,1,1,180,180,1,1,1,1,,,7,8,8,9,99,9,8,1,2,,2,,2,,2,,2,17,,,11,1,Aguascalientes,2,HGZ 1 Aguascalientes,706,1,1,7.510889759,2019-11-12,1
115445867,1,HGZ 1 Aguascalientes,11,12,11,2019,18,2,18,15,1,1,4,1,43,2,5,9,1,,,,,,2,1,2,2,2,2,2,6,97,97,,,,,1,2,10,96,5,2,1,,,,29,,,61,,,2,,,,1,10,1,10,1,10,2,,1,10,2,,1,10,2,,2,,2,,2,,2,,2,,,,,,,1,1,1,1,2,,2,,,,2,40,4,15,3,20,2,,,,,,,,,,,,1,1,1,1,1,1,1,2,2,2,2,,2,,2,,2,,2,,2,,2,,,,,,,,2,,,,2,,,,1,1,1,,,10,10,10,10,10,10,99,99,2,,2,,2,,2,,1,40,,,11,1,Aguascalientes,2,HGZ 1 Aguascalientes,706,1,1,9.763897105,2019-11-12,1
115447598,1,HGZ 1 Aguascalientes,11,12,11,2019,17,36,17,56,1,1,2,1,67,1,3,5,1,,,,,,5,1,2,2,2,2,2,5,7,97,5,0,,,1,2,13,,2,2,2,,,,17,,,61,,,1,,,,2,,2,,1,10,1,9,2,,2,,1,10,2,,2,,2,,2,,2,,2,,,,,,,1,1,1,1,2,,1,99999,99999,99999,2,20,3,240,5,15,2,,,,,,,,,,,,97,97,,1,1,1,1,2,2,2,2,,1,99,1,2,2,,1,1,,,,,4,2,3,2,4,2,1,60,30,1,1,30,99999,1,1,1,1,,,5,5,8,8,10,10,97,,2,,2,,2,,2,,1,18,36,,11,1,Aguascalientes,2,HGZ 1 Aguascalientes,706,1,1,7.334753163,2019-11-12,1
115450146,1,HGZ 1 Aguascalientes,11,12,11,2019,18,37,18,50,1,1,2,1,30,1,5,5,1,,,,,,5,2,2,2,2,2,2,4,97,97,,,,,2,2,13,,2,2,1,,,,3,,,42,,,2,,,,1,8,2,,1,10,2,,2,,2,,1,9,2,,2,,2,,2,,2,,2,,,,,,,1,1,1,1,2,,1,60,0.041666667,99999,2,45,4,30,5,20,1,1,1,1,1,2,2,2,2,1,2,2,1,1,1,1,1,1,1,2,2,2,2,,2,,2,,2,,2,,,,,,3,8,99997,99997,3,8,2,,,,1,99997,99999,1,1,1,1,,,8,9,9,10,6,9,97,,2,,2,,2,,2,,2,13,,,11,1,Aguascalientes,2,HGZ 1 Aguascalientes,706,1,1,8.675984677,2019-11-12,1
115450441,1,HGZ 1 Aguascalientes,11,12,11,2019,18,41,18,55,1,1,2,2,49,1,5,1,2,1,1,8,2,,5,2,2,2,2,2,2,,,,,,,,,,,,,2,1,,,,4,,,22,,,1,,,,2,,2,,1,10,1,10,2,,2,,1,10,2,,2,,2,,2,,2,,2,,,,,,,1,1,1,1,2,,1,20,0.013888889,11,1,20,2,240,3,40,1,1,1,1,1,1,1,1,1,1,1,1,1,1,1,1,1,1,1,1,,,,,,,,,,,,,,,,,,,,,,,2,,,,2,,,,1,1,1,,,10,10,10,10,10,8,10,1,2,,2,,2,,2,,1,2,,,11,1,Aguascalientes,2,HGZ 1 Aguascalientes,706,1,1,8.080199562,2019-11-12,1
115452396,1,HGZ 1 Aguascalientes,11,12,11,2019,18,35,18,48,1,1,2,1,55,2,3,1,1,,,,,,2,2,2,2,2,2,2,6,2,3,1,30,1,0,1,2,5,3,3,2,2,,,,27,,,36,,,2,,,,2,,1,7,1,9,2,,2,,2,,1,8,2,,2,,2,,2,,2,,2,,,,,,,1,1,1,1,2,,1,10,0.006944444,99999,2,20,3,1,1,5,2,,,,,,,,,,,,1,1,1,1,1,1,1,1,2,2,2,,1,1,1,1,2,,2,,2,,2,,,,,,,,2,,,,2,,,,1,1,1,,,8,7,8,9,9,9,9,99,2,,2,,2,,2,,2,1,,,11,1,Aguascalientes,2,HGZ 1 Aguascalientes,706,1,1,7.687441752,2019-11-12,1
115452706,1,HGZ 1 Aguascalientes,11,12,11,2019,18,29,18,48,1,1,4,1,63,1,5,2,1,,,,,,1,2,2,2,2,2,2,4,7,97,0,15,,,1,2,13,,4,2,1,,,,29,,,144,,,1,,,,1,10,2,,1,10,2,,1,10,2,,1,10,2,,2,,2,,2,,2,,2,,,,,,,1,1,1,1,2,,2,,,,2,60,4,5,2,15,2,,,,,,,,,,,,1,1,1,1,1,1,1,2,1,2,2,,1,2,1,2,,,1,7,,,,,4,2,3,7,3,7,1,1,25,1,2,,,,1,1,1,,,10,8,10,10,99,10,10,1,2,,2,,2,,2,,1,995,,,11,1,Aguascalientes,2,HGZ 1 Aguascalientes,706,1,1,7.510889759,2019-11-12,1